BDBM50436637 CHEMBL2398269
SMILES COC(=O)c1cccc(c1)-c1ccc(CN=Nc2nc3ccccc3s2)o1
InChI Key InChIKey=PNUCZJUGCJYJDZ-UHFFFAOYSA-N
Data  1 IC50
  Tab Delimited (TSV)   2D SDfile   Computed 3D by Vconf -m prep SDfile
Find this compound or compounds like it in BindingDB:
Activity Spreadsheet -- Enzyme Inhibition Constant Data from BindingDB
Found 1 hit for monomerid = 50436637
TargetBcl-2-like protein 1(Homo sapiens (Human))
The Walter And Eliza Hall Institute Of Medical Research
Curated by ChEMBL
LigandPNGBDBM50436637(CHEMBL2398269)
Affinity DataIC50: >1.00E+5nM. Assay description: Binding affinity to human GST-tagged Bcl-Xl by luminescence proximity assay
In DepthDetails ArticlePubMed